Build started at 2026-09-24T01:48:03.154894
Main binary: /usr/bin/python3
Build Options: -Denable_tools=false -Denable_tests=false -Dprefix=/home/runner/work/_temp/mmd-ffmpeg/prefix -Dlibdir=lib -Dbuildtype=release -Ddefault_library=static -Dwrap_mode=nodownload --cross-file=/home/runner/work/_temp/mmd-ffmpeg/evidence/meson-cross.ini
Python system: Linux
The Meson build system
Version: 1.3.2
Source dir: /home/runner/work/_temp/mmd-ffmpeg/src/dav1d
Build dir: /home/runner/work/_temp/mmd-ffmpeg/build/dav1d
Build type: cross build
Project name: dav1d
Project version: 1.5.4
-----------
Detecting compiler via: `x86_64-w64-mingw32-gcc-win32 --version` -> 0
stdout:
x86_64-w64-mingw32-gcc-win32 (GCC) 13-win32
Copyright (C) 2023 Free Software Foundation, Inc.
This is free software; see the source for copying conditions.  There is NO
warranty; not even for MERCHANTABILITY or FITNESS FOR A PARTICULAR PURPOSE.
-----------
Running command: x86_64-w64-mingw32-gcc-win32 -E -dM -
-----
-----------
Detecting linker via: `x86_64-w64-mingw32-gcc-win32 -Wl,--version -L/home/runner/work/_temp/mmd-ffmpeg/prefix/lib -static -static-libgcc -static-libstdc++ -O3 -fPIC -I/home/runner/work/_temp/mmd-ffmpeg/prefix/include` -> 0
stdout:
GNU ld (GNU Binutils) 2.41.90.20240122
Copyright (C) 2024 Free Software Foundation, Inc.
This program is free software; you may redistribute it under the terms of
the GNU General Public License version 3 or (at your option) a later version.
This program has absolutely no warranty.
-----------
stderr:
collect2 version 13-win32
/usr/bin/x86_64-w64-mingw32-ld -plugin /usr/lib/gcc/x86_64-w64-mingw32/13-win32/liblto_plugin.so -plugin-opt=/usr/lib/gcc/x86_64-w64-mingw32/13-win32/lto-wrapper -plugin-opt=-fresolution=/tmp/ccdkV6aD.res -plugin-opt=-pass-through=-lmingw32 -plugin-opt=-pass-through=-lgcc -plugin-opt=-pass-through=-lgcc_eh -plugin-opt=-pass-through=-lmoldname -plugin-opt=-pass-through=-lmingwex -plugin-opt=-pass-through=-lmsvcrt -plugin-opt=-pass-through=-lkernel32 -plugin-opt=-pass-through=-ladvapi32 -plugin-opt=-pass-through=-lshell32 -plugin-opt=-pass-through=-luser32 -plugin-opt=-pass-through=-lkernel32 -plugin-opt=-pass-through=-lmingw32 -plugin-opt=-pass-through=-lgcc -plugin-opt=-pass-through=-lgcc_eh -plugin-opt=-pass-through=-lmoldname -plugin-opt=-pass-through=-lmingwex -plugin-opt=-pass-through=-lmsvcrt -plugin-opt=-pass-through=-lkernel32 -m i386pep -Bstatic /usr/lib/gcc/x86_64-w64-mingw32/13-win32/../../../../x86_64-w64-mingw32/lib/crt2.o /usr/lib/gcc/x86_64-w64-mingw32/13-win32/crtbegin.o -L/home/runner/work/_temp/mmd-ffmpeg/prefix/lib -L/usr/lib/gcc/x86_64-w64-mingw32/13-win32 -L/usr/lib/gcc/x86_64-w64-mingw32/13-win32/../../../../x86_64-w64-mingw32/lib --version -lmingw32 -lgcc -lgcc_eh -lmoldname -lmingwex -lmsvcrt -lkernel32 -ladvapi32 -lshell32 -luser32 -lkernel32 -lmingw32 -lgcc -lgcc_eh -lmoldname -lmingwex -lmsvcrt -lkernel32 /usr/lib/gcc/x86_64-w64-mingw32/13-win32/crtend.o
-----------
Sanity testing C compiler: x86_64-w64-mingw32-gcc-win32
Is cross compiler: True.
Sanity check compiler command line: x86_64-w64-mingw32-gcc-win32 sanitycheckc.c -o sanitycheckc_cross.exe -O3 -fPIC -I/home/runner/work/_temp/mmd-ffmpeg/prefix/include -D_FILE_OFFSET_BITS=64 -c
Sanity check compile stdout:

-----
Sanity check compile stderr:

-----
C compiler for the host machine: x86_64-w64-mingw32-gcc-win32 (gcc 13.0.0 "x86_64-w64-mingw32-gcc-win32 (GCC) 13-win32")
C linker for the host machine: x86_64-w64-mingw32-gcc-win32 ld.bfd 2.41.90.20240122
-----------
Detecting archiver via: `x86_64-w64-mingw32-ar --version` -> 0
stdout:
GNU ar (GNU Binutils) 2.41.90.20240122
Copyright (C) 2024 Free Software Foundation, Inc.
This program is free software; you may redistribute it under the terms of
the GNU General Public License version 3 or (at your option) any later version.
This program has absolutely no warranty.
-----------
-----------
Detecting compiler via: `cc --version` -> 0
stdout:
cc (Ubuntu 13.3.0-6ubuntu2~24.04.1) 13.3.0
Copyright (C) 2023 Free Software Foundation, Inc.
This is free software; see the source for copying conditions.  There is NO
warranty; not even for MERCHANTABILITY or FITNESS FOR A PARTICULAR PURPOSE.
-----------
Running command: cc -E -dM -
-----
-----------
Detecting linker via: `cc -Wl,--version` -> 0
stdout:
GNU ld (GNU Binutils for Ubuntu) 2.42
Copyright (C) 2024 Free Software Foundation, Inc.
This program is free software; you may redistribute it under the terms of
the GNU General Public License version 3 or (at your option) a later version.
This program has absolutely no warranty.
-----------
stderr:
collect2 version 13.3.0
/usr/bin/ld -plugin /usr/libexec/gcc/x86_64-linux-gnu/13/liblto_plugin.so -plugin-opt=/usr/libexec/gcc/x86_64-linux-gnu/13/lto-wrapper -plugin-opt=-fresolution=/tmp/ccRYW5bU.res -plugin-opt=-pass-through=-lgcc -plugin-opt=-pass-through=-lgcc_s -plugin-opt=-pass-through=-lc -plugin-opt=-pass-through=-lgcc -plugin-opt=-pass-through=-lgcc_s --build-id --eh-frame-hdr -m elf_x86_64 --hash-style=gnu --as-needed -dynamic-linker /lib64/ld-linux-x86-64.so.2 -pie -z now -z relro /usr/lib/gcc/x86_64-linux-gnu/13/../../../x86_64-linux-gnu/Scrt1.o /usr/lib/gcc/x86_64-linux-gnu/13/../../../x86_64-linux-gnu/crti.o /usr/lib/gcc/x86_64-linux-gnu/13/crtbeginS.o -L/usr/lib/gcc/x86_64-linux-gnu/13 -L/usr/lib/gcc/x86_64-linux-gnu/13/../../../x86_64-linux-gnu -L/usr/lib/gcc/x86_64-linux-gnu/13/../../../../lib -L/lib/x86_64-linux-gnu -L/lib/../lib -L/usr/lib/x86_64-linux-gnu -L/usr/lib/../lib -L/usr/lib/gcc/x86_64-linux-gnu/13/../../.. --version -lgcc --push-state --as-needed -lgcc_s --pop-state -lc -lgcc --push-state --as-needed -lgcc_s --pop-state /usr/lib/gcc/x86_64-linux-gnu/13/crtendS.o /usr/lib/gcc/x86_64-linux-gnu/13/../../../x86_64-linux-gnu/crtn.o
-----------
Sanity testing C compiler: cc
Is cross compiler: False.
Sanity check compiler command line: cc sanitycheckc.c -o sanitycheckc.exe -D_FILE_OFFSET_BITS=64
Sanity check compile stdout:

-----
Sanity check compile stderr:

-----
Running test binary command:  /home/runner/work/_temp/mmd-ffmpeg/build/dav1d/meson-private/sanitycheckc.exe
C compiler for the build machine: cc (gcc 13.3.0 "cc (Ubuntu 13.3.0-6ubuntu2~24.04.1) 13.3.0")
C linker for the build machine: cc ld.bfd 2.42
-----------
Detecting archiver via: `gcc-ar --version` -> 0
stdout:
GNU ar (GNU Binutils for Ubuntu) 2.42
Copyright (C) 2024 Free Software Foundation, Inc.
This program is free software; you may redistribute it under the terms of
the GNU General Public License version 3 or (at your option) any later version.
This program has absolutely no warranty.
-----------
Build machine cpu family: x86_64
Build machine cpu: x86_64
Host machine cpu family: x86_64
Host machine cpu: x86_64
Target machine cpu family: x86_64
Target machine cpu: x86_64
Running compile:
Working directory:  /tmp/tmpipze8q7t
Code:
 
        #include "dav1d/version.h"
        #ifndef DAV1D_API_VERSION_MAJOR
        # define DAV1D_API_VERSION_MAJOR "MESON_GET_DEFINE_UNDEFINED_SENTINEL"
        #endif
        "MESON_GET_DEFINE_DELIMITER_START"
DAV1D_API_VERSION_MAJOR
"MESON_GET_DEFINE_DELIMITER_END"
-----------
Command line: `x86_64-w64-mingw32-gcc-win32 -I/home/runner/work/_temp/mmd-ffmpeg/src/dav1d/. -I/home/runner/work/_temp/mmd-ffmpeg/build/dav1d/. -I/home/runner/work/_temp/mmd-ffmpeg/src/dav1d/include/dav1d -I/home/runner/work/_temp/mmd-ffmpeg/build/dav1d/include/dav1d -I/home/runner/work/_temp/mmd-ffmpeg/src/dav1d/include -I/home/runner/work/_temp/mmd-ffmpeg/build/dav1d/include -I/home/runner/work/_temp/mmd-ffmpeg/prefix/include /tmp/tmpipze8q7t/testfile.c -E -P -O3 -fPIC -D_FILE_OFFSET_BITS=64 -P -O0 -std=c99` -> 0
stdout:
"MESON_GET_DEFINE_DELIMITER_START"
7
"MESON_GET_DEFINE_DELIMITER_END"
-----------
Fetching value of define "DAV1D_API_VERSION_MAJOR" : 7 
Running compile:
Working directory:  /tmp/tmplliya9e3
Code:
 
        #include "dav1d/version.h"
        #ifndef DAV1D_API_VERSION_MINOR
        # define DAV1D_API_VERSION_MINOR "MESON_GET_DEFINE_UNDEFINED_SENTINEL"
        #endif
        "MESON_GET_DEFINE_DELIMITER_START"
DAV1D_API_VERSION_MINOR
"MESON_GET_DEFINE_DELIMITER_END"
-----------
Command line: `x86_64-w64-mingw32-gcc-win32 -I/home/runner/work/_temp/mmd-ffmpeg/src/dav1d/. -I/home/runner/work/_temp/mmd-ffmpeg/build/dav1d/. -I/home/runner/work/_temp/mmd-ffmpeg/src/dav1d/include/dav1d -I/home/runner/work/_temp/mmd-ffmpeg/build/dav1d/include/dav1d -I/home/runner/work/_temp/mmd-ffmpeg/src/dav1d/include -I/home/runner/work/_temp/mmd-ffmpeg/build/dav1d/include -I/home/runner/work/_temp/mmd-ffmpeg/prefix/include /tmp/tmplliya9e3/testfile.c -E -P -O3 -fPIC -D_FILE_OFFSET_BITS=64 -P -O0 -std=c99` -> 0
stdout:
"MESON_GET_DEFINE_DELIMITER_START"
0
"MESON_GET_DEFINE_DELIMITER_END"
-----------
Fetching value of define "DAV1D_API_VERSION_MINOR" : 0 
Running compile:
Working directory:  /tmp/tmpi2m4n0zi
Code:
 
        #include "dav1d/version.h"
        #ifndef DAV1D_API_VERSION_PATCH
        # define DAV1D_API_VERSION_PATCH "MESON_GET_DEFINE_UNDEFINED_SENTINEL"
        #endif
        "MESON_GET_DEFINE_DELIMITER_START"
DAV1D_API_VERSION_PATCH
"MESON_GET_DEFINE_DELIMITER_END"
-----------
Command line: `x86_64-w64-mingw32-gcc-win32 -I/home/runner/work/_temp/mmd-ffmpeg/src/dav1d/. -I/home/runner/work/_temp/mmd-ffmpeg/build/dav1d/. -I/home/runner/work/_temp/mmd-ffmpeg/src/dav1d/include/dav1d -I/home/runner/work/_temp/mmd-ffmpeg/build/dav1d/include/dav1d -I/home/runner/work/_temp/mmd-ffmpeg/src/dav1d/include -I/home/runner/work/_temp/mmd-ffmpeg/build/dav1d/include -I/home/runner/work/_temp/mmd-ffmpeg/prefix/include /tmp/tmpi2m4n0zi/testfile.c -E -P -O3 -fPIC -D_FILE_OFFSET_BITS=64 -P -O0 -std=c99` -> 0
stdout:
"MESON_GET_DEFINE_DELIMITER_START"
0
"MESON_GET_DEFINE_DELIMITER_END"
-----------
Fetching value of define "DAV1D_API_VERSION_PATCH" : 0 
Running compile:
Working directory:  /tmp/tmpwlppdb_7
Code:
 
        
        #ifndef __ILP32__
        # define __ILP32__ "MESON_GET_DEFINE_UNDEFINED_SENTINEL"
        #endif
        "MESON_GET_DEFINE_DELIMITER_START"
__ILP32__
"MESON_GET_DEFINE_DELIMITER_END"
-----------
Command line: `x86_64-w64-mingw32-gcc-win32 -I/home/runner/work/_temp/mmd-ffmpeg/prefix/include /tmp/tmpwlppdb_7/testfile.c -E -P -O3 -fPIC -D_FILE_OFFSET_BITS=64 -P -O0 -std=c99` -> 0
stdout:
"MESON_GET_DEFINE_DELIMITER_START"
"MESON_GET_DEFINE_UNDEFINED_SENTINEL"
"MESON_GET_DEFINE_DELIMITER_END"
-----------
Fetching value of define "__ILP32__" : (undefined) 
Running compile:
Working directory:  /home/runner/work/_temp/mmd-ffmpeg/build/dav1d/meson-private/tmpvmv_yu9n
Code:
 #include <stdio.h>
#include <limits.h>

        #if defined __stub_fseeko || defined __stub___fseeko
        fail fail fail this function is not going to work
        #endif
        
int main(void) {
            void *a = (void*) &fseeko;
            long long b = (long long) a;
            return (int) b;
        }
-----------
Command line: `x86_64-w64-mingw32-gcc-win32 -L/home/runner/work/_temp/mmd-ffmpeg/prefix/lib -I/home/runner/work/_temp/mmd-ffmpeg/prefix/include /home/runner/work/_temp/mmd-ffmpeg/build/dav1d/meson-private/tmpvmv_yu9n/testfile.c -o /home/runner/work/_temp/mmd-ffmpeg/build/dav1d/meson-private/tmpvmv_yu9n/output.exe -O3 -fPIC -D_FILE_OFFSET_BITS=64 -O0 -std=c99 -Wl,--start-group -lkernel32 -luser32 -lgdi32 -lwinspool -lshell32 -lole32 -loleaut32 -luuid -lcomdlg32 -ladvapi32 -Wl,--end-group -static -static-libgcc -static-libstdc++` -> 0
Checking for function "fseeko" : YES 
Running compile:
Working directory:  /home/runner/work/_temp/mmd-ffmpeg/build/dav1d/meson-private/tmp2kpaufcy
Code:
 int main(void) { return 0; }

-----------
Command line: `x86_64-w64-mingw32-gcc-win32 -L/home/runner/work/_temp/mmd-ffmpeg/prefix/lib -I/home/runner/work/_temp/mmd-ffmpeg/prefix/include /home/runner/work/_temp/mmd-ffmpeg/build/dav1d/meson-private/tmp2kpaufcy/testfile.c -o /home/runner/work/_temp/mmd-ffmpeg/build/dav1d/meson-private/tmp2kpaufcy/output.exe -O3 -fPIC -D_FILE_OFFSET_BITS=64 -O0 -Wl,--start-group -lm -Wl,--end-group -Wl,--allow-shlib-undefined -static -static-libgcc -static-libstdc++` -> 0
Library m found: YES
Running compile:
Working directory:  /home/runner/work/_temp/mmd-ffmpeg/build/dav1d/meson-private/tmpzpzg1iuh
Code:
 
        #include <stdatomic.h>
-----------
Command line: `x86_64-w64-mingw32-gcc-win32 -I/home/runner/work/_temp/mmd-ffmpeg/prefix/include /home/runner/work/_temp/mmd-ffmpeg/build/dav1d/meson-private/tmpzpzg1iuh/testfile.c -o /home/runner/work/_temp/mmd-ffmpeg/build/dav1d/meson-private/tmpzpzg1iuh/output.obj -c -O3 -fPIC -D_FILE_OFFSET_BITS=64 -O0 -std=c99` -> 0
Check usable header "stdatomic.h" : YES 
Running compile:
Working directory:  /home/runner/work/_temp/mmd-ffmpeg/build/dav1d/meson-private/tmpn58sj4um
Code:
 
        #include <sys/types.h>
-----------
Command line: `x86_64-w64-mingw32-gcc-win32 -I/home/runner/work/_temp/mmd-ffmpeg/prefix/include /home/runner/work/_temp/mmd-ffmpeg/build/dav1d/meson-private/tmpn58sj4um/testfile.c -o /home/runner/work/_temp/mmd-ffmpeg/build/dav1d/meson-private/tmpn58sj4um/output.obj -c -O3 -fPIC -D_FILE_OFFSET_BITS=64 -O0 -std=c99` -> 0
Check usable header "sys/types.h" : YES 
Running compile:
Working directory:  /home/runner/work/_temp/mmd-ffmpeg/build/dav1d/meson-private/tmpzferp05o
Code:
 
        #include <unistd.h>
-----------
Command line: `x86_64-w64-mingw32-gcc-win32 -I/home/runner/work/_temp/mmd-ffmpeg/prefix/include /home/runner/work/_temp/mmd-ffmpeg/build/dav1d/meson-private/tmpzferp05o/testfile.c -o /home/runner/work/_temp/mmd-ffmpeg/build/dav1d/meson-private/tmpzferp05o/output.obj -c -O3 -fPIC -D_FILE_OFFSET_BITS=64 -O0 -std=c99` -> 0
Check usable header "unistd.h" : YES 
Running compile:
Working directory:  /home/runner/work/_temp/mmd-ffmpeg/build/dav1d/meson-private/tmpiwe5aidw
Code:
 
        #include <io.h>
-----------
Command line: `x86_64-w64-mingw32-gcc-win32 -I/home/runner/work/_temp/mmd-ffmpeg/prefix/include /home/runner/work/_temp/mmd-ffmpeg/build/dav1d/meson-private/tmpiwe5aidw/testfile.c -o /home/runner/work/_temp/mmd-ffmpeg/build/dav1d/meson-private/tmpiwe5aidw/output.obj -c -O3 -fPIC -D_FILE_OFFSET_BITS=64 -O0 -std=c99` -> 0
Check usable header "io.h" : YES 
Running compile:
Working directory:  /home/runner/work/_temp/mmd-ffmpeg/build/dav1d/meson-private/tmpw2le0u3_
Code:
 
        #include <pthread_np.h>
-----------
Command line: `x86_64-w64-mingw32-gcc-win32 -I/home/runner/work/_temp/mmd-ffmpeg/prefix/include /home/runner/work/_temp/mmd-ffmpeg/build/dav1d/meson-private/tmpw2le0u3_/testfile.c -o /home/runner/work/_temp/mmd-ffmpeg/build/dav1d/meson-private/tmpw2le0u3_/output.obj -c -O3 -fPIC -D_FILE_OFFSET_BITS=64 -O0 -std=c99` -> 1
stderr:
/home/runner/work/_temp/mmd-ffmpeg/build/dav1d/meson-private/tmpw2le0u3_/testfile.c:2:18: fatal error: pthread_np.h: No such file or directory
    2 |         #include <pthread_np.h>
      |                  ^~~~~~~~~~~~~~
compilation terminated.
-----------
Check usable header "pthread_np.h" : NO 
Running compile:
Working directory:  /home/runner/work/_temp/mmd-ffmpeg/build/dav1d/meson-private/tmpcrqz63nl
Code:
 #include <getopt.h>
#include <limits.h>

        #if defined __stub_getopt_long || defined __stub___getopt_long
        fail fail fail this function is not going to work
        #endif
        
int main(void) {
            void *a = (void*) &getopt_long;
            long long b = (long long) a;
            return (int) b;
        }
-----------
Command line: `x86_64-w64-mingw32-gcc-win32 -L/home/runner/work/_temp/mmd-ffmpeg/prefix/lib -I/home/runner/work/_temp/mmd-ffmpeg/prefix/include /home/runner/work/_temp/mmd-ffmpeg/build/dav1d/meson-private/tmpcrqz63nl/testfile.c -o /home/runner/work/_temp/mmd-ffmpeg/build/dav1d/meson-private/tmpcrqz63nl/output.exe -O3 -fPIC -D_FILE_OFFSET_BITS=64 -O0 -std=c99 -Wl,--start-group -lkernel32 -luser32 -lgdi32 -lwinspool -lshell32 -lole32 -loleaut32 -luuid -lcomdlg32 -ladvapi32 -Wl,--end-group -DHAVE_PTHREAD_NP_H=0 -static -static-libgcc -static-libstdc++` -> 0
Checking for function "getopt_long" : YES 
Running compile:
Working directory:  /home/runner/work/_temp/mmd-ffmpeg/build/dav1d/meson-private/tmpw_6u26rw
Code:
 
#include <pthread.h>
#if HAVE_PTHREAD_NP_H
#include <pthread_np.h>
#endif

#include <limits.h>

        #if defined __stub_pthread_getaffinity_np || defined __stub___pthread_getaffinity_np
        fail fail fail this function is not going to work
        #endif
        
int main(void) {
            void *a = (void*) &pthread_getaffinity_np;
            long long b = (long long) a;
            return (int) b;
        }
-----------
Command line: `x86_64-w64-mingw32-gcc-win32 -L/home/runner/work/_temp/mmd-ffmpeg/prefix/lib -I/home/runner/work/_temp/mmd-ffmpeg/prefix/include /home/runner/work/_temp/mmd-ffmpeg/build/dav1d/meson-private/tmpw_6u26rw/testfile.c -o /home/runner/work/_temp/mmd-ffmpeg/build/dav1d/meson-private/tmpw_6u26rw/output.exe -O3 -fPIC -D_FILE_OFFSET_BITS=64 -O0 -std=c99 -Wl,--start-group -lkernel32 -luser32 -lgdi32 -lwinspool -lshell32 -lole32 -loleaut32 -luuid -lcomdlg32 -ladvapi32 -Wl,--end-group -DHAVE_PTHREAD_NP_H=0 -static -static-libgcc -static-libstdc++` -> 1
stderr:
/home/runner/work/_temp/mmd-ffmpeg/build/dav1d/meson-private/tmpw_6u26rw/testfile.c: In function 'main':
/home/runner/work/_temp/mmd-ffmpeg/build/dav1d/meson-private/tmpw_6u26rw/testfile.c:14:32: error: 'pthread_getaffinity_np' undeclared (first use in this function); did you mean 'pthread_getname_np'?
   14 |             void *a = (void*) &pthread_getaffinity_np;
      |                                ^~~~~~~~~~~~~~~~~~~~~~
      |                                pthread_getname_np
/home/runner/work/_temp/mmd-ffmpeg/build/dav1d/meson-private/tmpw_6u26rw/testfile.c:14:32: note: each undeclared identifier is reported only once for each function it appears in
-----------
Running compile:
Working directory:  /home/runner/work/_temp/mmd-ffmpeg/build/dav1d/meson-private/tmpb1zdl12n
Code:
 
#include <pthread.h>
#if HAVE_PTHREAD_NP_H
#include <pthread_np.h>
#endif

        int main(void) {

        /* With some toolchains (MSYS2/mingw for example) the compiler
         * provides various builtins which are not really implemented and
         * fall back to the stdlib where they aren't provided and fail at
         * build/link time. In case the user provides a header, including
         * the header didn't lead to the function being defined, and the
         * function we are checking isn't a builtin itself we assume the
         * builtin is not functional and we just error out. */
        #if !0 && !defined(pthread_getaffinity_np) && !0
            #error "No definition for __builtin_pthread_getaffinity_np found in the prefix"
        #endif

        #ifdef __has_builtin
            #if !__has_builtin(__builtin_pthread_getaffinity_np)
                #error "__builtin_pthread_getaffinity_np not found"
            #endif
        #elif ! defined(pthread_getaffinity_np)
            __builtin_pthread_getaffinity_np;
        #endif
        return 0;
        }
-----------
Command line: `x86_64-w64-mingw32-gcc-win32 -L/home/runner/work/_temp/mmd-ffmpeg/prefix/lib -I/home/runner/work/_temp/mmd-ffmpeg/prefix/include /home/runner/work/_temp/mmd-ffmpeg/build/dav1d/meson-private/tmpb1zdl12n/testfile.c -o /home/runner/work/_temp/mmd-ffmpeg/build/dav1d/meson-private/tmpb1zdl12n/output.exe -O3 -fPIC -D_FILE_OFFSET_BITS=64 -O0 -std=c99 -Wl,--start-group -lkernel32 -luser32 -lgdi32 -lwinspool -lshell32 -lole32 -loleaut32 -luuid -lcomdlg32 -ladvapi32 -Wl,--end-group -DHAVE_PTHREAD_NP_H=0 -static -static-libgcc -static-libstdc++` -> 1
stderr:
/home/runner/work/_temp/mmd-ffmpeg/build/dav1d/meson-private/tmpb1zdl12n/testfile.c: In function 'main':
/home/runner/work/_temp/mmd-ffmpeg/build/dav1d/meson-private/tmpb1zdl12n/testfile.c:17:14: error: #error "No definition for __builtin_pthread_getaffinity_np found in the prefix"
   17 |             #error "No definition for __builtin_pthread_getaffinity_np found in the prefix"
      |              ^~~~~
/home/runner/work/_temp/mmd-ffmpeg/build/dav1d/meson-private/tmpb1zdl12n/testfile.c:22:18: error: #error "__builtin_pthread_getaffinity_np not found"
   22 |                 #error "__builtin_pthread_getaffinity_np not found"
      |                  ^~~~~
-----------
Checking for function "pthread_getaffinity_np" : NO 
Running compile:
Working directory:  /home/runner/work/_temp/mmd-ffmpeg/build/dav1d/meson-private/tmp0xfzsrp8
Code:
 
#include <pthread.h>
#if HAVE_PTHREAD_NP_H
#include <pthread_np.h>
#endif

#include <limits.h>

        #if defined __stub_pthread_setaffinity_np || defined __stub___pthread_setaffinity_np
        fail fail fail this function is not going to work
        #endif
        
int main(void) {
            void *a = (void*) &pthread_setaffinity_np;
            long long b = (long long) a;
            return (int) b;
        }
-----------
Command line: `x86_64-w64-mingw32-gcc-win32 -L/home/runner/work/_temp/mmd-ffmpeg/prefix/lib -I/home/runner/work/_temp/mmd-ffmpeg/prefix/include /home/runner/work/_temp/mmd-ffmpeg/build/dav1d/meson-private/tmp0xfzsrp8/testfile.c -o /home/runner/work/_temp/mmd-ffmpeg/build/dav1d/meson-private/tmp0xfzsrp8/output.exe -O3 -fPIC -D_FILE_OFFSET_BITS=64 -O0 -std=c99 -Wl,--start-group -lkernel32 -luser32 -lgdi32 -lwinspool -lshell32 -lole32 -loleaut32 -luuid -lcomdlg32 -ladvapi32 -Wl,--end-group -DHAVE_PTHREAD_NP_H=0 -static -static-libgcc -static-libstdc++` -> 1
stderr:
/home/runner/work/_temp/mmd-ffmpeg/build/dav1d/meson-private/tmp0xfzsrp8/testfile.c: In function 'main':
/home/runner/work/_temp/mmd-ffmpeg/build/dav1d/meson-private/tmp0xfzsrp8/testfile.c:14:32: error: 'pthread_setaffinity_np' undeclared (first use in this function); did you mean 'pthread_setname_np'?
   14 |             void *a = (void*) &pthread_setaffinity_np;
      |                                ^~~~~~~~~~~~~~~~~~~~~~
      |                                pthread_setname_np
/home/runner/work/_temp/mmd-ffmpeg/build/dav1d/meson-private/tmp0xfzsrp8/testfile.c:14:32: note: each undeclared identifier is reported only once for each function it appears in
-----------
Running compile:
Working directory:  /home/runner/work/_temp/mmd-ffmpeg/build/dav1d/meson-private/tmpqihdy97u
Code:
 
#include <pthread.h>
#if HAVE_PTHREAD_NP_H
#include <pthread_np.h>
#endif

        int main(void) {

        /* With some toolchains (MSYS2/mingw for example) the compiler
         * provides various builtins which are not really implemented and
         * fall back to the stdlib where they aren't provided and fail at
         * build/link time. In case the user provides a header, including
         * the header didn't lead to the function being defined, and the
         * function we are checking isn't a builtin itself we assume the
         * builtin is not functional and we just error out. */
        #if !0 && !defined(pthread_setaffinity_np) && !0
            #error "No definition for __builtin_pthread_setaffinity_np found in the prefix"
        #endif

        #ifdef __has_builtin
            #if !__has_builtin(__builtin_pthread_setaffinity_np)
                #error "__builtin_pthread_setaffinity_np not found"
            #endif
        #elif ! defined(pthread_setaffinity_np)
            __builtin_pthread_setaffinity_np;
        #endif
        return 0;
        }
-----------
Command line: `x86_64-w64-mingw32-gcc-win32 -L/home/runner/work/_temp/mmd-ffmpeg/prefix/lib -I/home/runner/work/_temp/mmd-ffmpeg/prefix/include /home/runner/work/_temp/mmd-ffmpeg/build/dav1d/meson-private/tmpqihdy97u/testfile.c -o /home/runner/work/_temp/mmd-ffmpeg/build/dav1d/meson-private/tmpqihdy97u/output.exe -O3 -fPIC -D_FILE_OFFSET_BITS=64 -O0 -std=c99 -Wl,--start-group -lkernel32 -luser32 -lgdi32 -lwinspool -lshell32 -lole32 -loleaut32 -luuid -lcomdlg32 -ladvapi32 -Wl,--end-group -DHAVE_PTHREAD_NP_H=0 -static -static-libgcc -static-libstdc++` -> 1
stderr:
/home/runner/work/_temp/mmd-ffmpeg/build/dav1d/meson-private/tmpqihdy97u/testfile.c: In function 'main':
/home/runner/work/_temp/mmd-ffmpeg/build/dav1d/meson-private/tmpqihdy97u/testfile.c:17:14: error: #error "No definition for __builtin_pthread_setaffinity_np found in the prefix"
   17 |             #error "No definition for __builtin_pthread_setaffinity_np found in the prefix"
      |              ^~~~~
/home/runner/work/_temp/mmd-ffmpeg/build/dav1d/meson-private/tmpqihdy97u/testfile.c:22:18: error: #error "__builtin_pthread_setaffinity_np not found"
   22 |                 #error "__builtin_pthread_setaffinity_np not found"
      |                  ^~~~~
-----------
Checking for function "pthread_setaffinity_np" : NO 
Running compile:
Working directory:  /home/runner/work/_temp/mmd-ffmpeg/build/dav1d/meson-private/tmpz66vqxl3
Code:
 
#include <pthread.h>
#if HAVE_PTHREAD_NP_H
#include <pthread_np.h>
#endif

#include <limits.h>

        #if defined __stub_pthread_setname_np || defined __stub___pthread_setname_np
        fail fail fail this function is not going to work
        #endif
        
int main(void) {
            void *a = (void*) &pthread_setname_np;
            long long b = (long long) a;
            return (int) b;
        }
-----------
Command line: `x86_64-w64-mingw32-gcc-win32 -L/home/runner/work/_temp/mmd-ffmpeg/prefix/lib -I/home/runner/work/_temp/mmd-ffmpeg/prefix/include /home/runner/work/_temp/mmd-ffmpeg/build/dav1d/meson-private/tmpz66vqxl3/testfile.c -o /home/runner/work/_temp/mmd-ffmpeg/build/dav1d/meson-private/tmpz66vqxl3/output.exe -O3 -fPIC -D_FILE_OFFSET_BITS=64 -O0 -std=c99 -Wl,--start-group -lkernel32 -luser32 -lgdi32 -lwinspool -lshell32 -lole32 -loleaut32 -luuid -lcomdlg32 -ladvapi32 -Wl,--end-group -DHAVE_PTHREAD_NP_H=0 -static -static-libgcc -static-libstdc++` -> 1
stderr:
/usr/bin/x86_64-w64-mingw32-ld: /tmp/cc4pfDep.o:testfile.c:(.rdata$.refptr.pthread_setname_np[.refptr.pthread_setname_np]+0x0): undefined reference to `pthread_setname_np'
collect2: error: ld returned 1 exit status
-----------
Running compile:
Working directory:  /home/runner/work/_temp/mmd-ffmpeg/build/dav1d/meson-private/tmp2ntzixfv
Code:
 
#include <pthread.h>
#if HAVE_PTHREAD_NP_H
#include <pthread_np.h>
#endif

        int main(void) {

        /* With some toolchains (MSYS2/mingw for example) the compiler
         * provides various builtins which are not really implemented and
         * fall back to the stdlib where they aren't provided and fail at
         * build/link time. In case the user provides a header, including
         * the header didn't lead to the function being defined, and the
         * function we are checking isn't a builtin itself we assume the
         * builtin is not functional and we just error out. */
        #if !0 && !defined(pthread_setname_np) && !0
            #error "No definition for __builtin_pthread_setname_np found in the prefix"
        #endif

        #ifdef __has_builtin
            #if !__has_builtin(__builtin_pthread_setname_np)
                #error "__builtin_pthread_setname_np not found"
            #endif
        #elif ! defined(pthread_setname_np)
            __builtin_pthread_setname_np;
        #endif
        return 0;
        }
-----------
Command line: `x86_64-w64-mingw32-gcc-win32 -L/home/runner/work/_temp/mmd-ffmpeg/prefix/lib -I/home/runner/work/_temp/mmd-ffmpeg/prefix/include /home/runner/work/_temp/mmd-ffmpeg/build/dav1d/meson-private/tmp2ntzixfv/testfile.c -o /home/runner/work/_temp/mmd-ffmpeg/build/dav1d/meson-private/tmp2ntzixfv/output.exe -O3 -fPIC -D_FILE_OFFSET_BITS=64 -O0 -std=c99 -Wl,--start-group -lkernel32 -luser32 -lgdi32 -lwinspool -lshell32 -lole32 -loleaut32 -luuid -lcomdlg32 -ladvapi32 -Wl,--end-group -DHAVE_PTHREAD_NP_H=0 -static -static-libgcc -static-libstdc++` -> 1
stderr:
/home/runner/work/_temp/mmd-ffmpeg/build/dav1d/meson-private/tmp2ntzixfv/testfile.c: In function 'main':
/home/runner/work/_temp/mmd-ffmpeg/build/dav1d/meson-private/tmp2ntzixfv/testfile.c:17:14: error: #error "No definition for __builtin_pthread_setname_np found in the prefix"
   17 |             #error "No definition for __builtin_pthread_setname_np found in the prefix"
      |              ^~~~~
/home/runner/work/_temp/mmd-ffmpeg/build/dav1d/meson-private/tmp2ntzixfv/testfile.c:22:18: error: #error "__builtin_pthread_setname_np not found"
   22 |                 #error "__builtin_pthread_setname_np not found"
      |                  ^~~~~
-----------
Checking for function "pthread_setname_np" : NO 
Running compile:
Working directory:  /home/runner/work/_temp/mmd-ffmpeg/build/dav1d/meson-private/tmp_fn32hu5
Code:
 
#include <pthread.h>
#if HAVE_PTHREAD_NP_H
#include <pthread_np.h>
#endif

#include <limits.h>

        #if defined __stub_pthread_set_name_np || defined __stub___pthread_set_name_np
        fail fail fail this function is not going to work
        #endif
        
int main(void) {
            void *a = (void*) &pthread_set_name_np;
            long long b = (long long) a;
            return (int) b;
        }
-----------
Command line: `x86_64-w64-mingw32-gcc-win32 -L/home/runner/work/_temp/mmd-ffmpeg/prefix/lib -I/home/runner/work/_temp/mmd-ffmpeg/prefix/include /home/runner/work/_temp/mmd-ffmpeg/build/dav1d/meson-private/tmp_fn32hu5/testfile.c -o /home/runner/work/_temp/mmd-ffmpeg/build/dav1d/meson-private/tmp_fn32hu5/output.exe -O3 -fPIC -D_FILE_OFFSET_BITS=64 -O0 -std=c99 -Wl,--start-group -lkernel32 -luser32 -lgdi32 -lwinspool -lshell32 -lole32 -loleaut32 -luuid -lcomdlg32 -ladvapi32 -Wl,--end-group -DHAVE_PTHREAD_NP_H=0 -static -static-libgcc -static-libstdc++` -> 1
stderr:
/home/runner/work/_temp/mmd-ffmpeg/build/dav1d/meson-private/tmp_fn32hu5/testfile.c: In function 'main':
/home/runner/work/_temp/mmd-ffmpeg/build/dav1d/meson-private/tmp_fn32hu5/testfile.c:14:32: error: 'pthread_set_name_np' undeclared (first use in this function); did you mean 'pthread_setname_np'?
   14 |             void *a = (void*) &pthread_set_name_np;
      |                                ^~~~~~~~~~~~~~~~~~~
      |                                pthread_setname_np
/home/runner/work/_temp/mmd-ffmpeg/build/dav1d/meson-private/tmp_fn32hu5/testfile.c:14:32: note: each undeclared identifier is reported only once for each function it appears in
-----------
Running compile:
Working directory:  /home/runner/work/_temp/mmd-ffmpeg/build/dav1d/meson-private/tmpuy411_cj
Code:
 
#include <pthread.h>
#if HAVE_PTHREAD_NP_H
#include <pthread_np.h>
#endif

        int main(void) {

        /* With some toolchains (MSYS2/mingw for example) the compiler
         * provides various builtins which are not really implemented and
         * fall back to the stdlib where they aren't provided and fail at
         * build/link time. In case the user provides a header, including
         * the header didn't lead to the function being defined, and the
         * function we are checking isn't a builtin itself we assume the
         * builtin is not functional and we just error out. */
        #if !0 && !defined(pthread_set_name_np) && !0
            #error "No definition for __builtin_pthread_set_name_np found in the prefix"
        #endif

        #ifdef __has_builtin
            #if !__has_builtin(__builtin_pthread_set_name_np)
                #error "__builtin_pthread_set_name_np not found"
            #endif
        #elif ! defined(pthread_set_name_np)
            __builtin_pthread_set_name_np;
        #endif
        return 0;
        }
-----------
Command line: `x86_64-w64-mingw32-gcc-win32 -L/home/runner/work/_temp/mmd-ffmpeg/prefix/lib -I/home/runner/work/_temp/mmd-ffmpeg/prefix/include /home/runner/work/_temp/mmd-ffmpeg/build/dav1d/meson-private/tmpuy411_cj/testfile.c -o /home/runner/work/_temp/mmd-ffmpeg/build/dav1d/meson-private/tmpuy411_cj/output.exe -O3 -fPIC -D_FILE_OFFSET_BITS=64 -O0 -std=c99 -Wl,--start-group -lkernel32 -luser32 -lgdi32 -lwinspool -lshell32 -lole32 -loleaut32 -luuid -lcomdlg32 -ladvapi32 -Wl,--end-group -DHAVE_PTHREAD_NP_H=0 -static -static-libgcc -static-libstdc++` -> 1
stderr:
/home/runner/work/_temp/mmd-ffmpeg/build/dav1d/meson-private/tmpuy411_cj/testfile.c: In function 'main':
/home/runner/work/_temp/mmd-ffmpeg/build/dav1d/meson-private/tmpuy411_cj/testfile.c:17:14: error: #error "No definition for __builtin_pthread_set_name_np found in the prefix"
   17 |             #error "No definition for __builtin_pthread_set_name_np found in the prefix"
      |              ^~~~~
/home/runner/work/_temp/mmd-ffmpeg/build/dav1d/meson-private/tmpuy411_cj/testfile.c:22:18: error: #error "__builtin_pthread_set_name_np not found"
   22 |                 #error "__builtin_pthread_set_name_np not found"
      |                  ^~~~~
-----------
Checking for function "pthread_set_name_np" : NO 
Running compile:
Working directory:  /home/runner/work/_temp/mmd-ffmpeg/build/dav1d/meson-private/tmpswql4z0e
Code:
 int x = _Generic(0, default: 0);
-----------
Command line: `x86_64-w64-mingw32-gcc-win32 -I/home/runner/work/_temp/mmd-ffmpeg/prefix/include /home/runner/work/_temp/mmd-ffmpeg/build/dav1d/meson-private/tmpswql4z0e/testfile.c -o /home/runner/work/_temp/mmd-ffmpeg/build/dav1d/meson-private/tmpswql4z0e/output.obj -c -O3 -fPIC -D_FILE_OFFSET_BITS=64 -O0 -std=c99 -DHAVE_PTHREAD_NP_H=0` -> 0
Checking if "_Generic" compiles: YES 
Running compile:
Working directory:  /home/runner/work/_temp/mmd-ffmpeg/build/dav1d/meson-private/tmpopcyady9
Code:
 extern int i;
int i;

-----------
Command line: `x86_64-w64-mingw32-gcc-win32 -I/home/runner/work/_temp/mmd-ffmpeg/prefix/include /home/runner/work/_temp/mmd-ffmpeg/build/dav1d/meson-private/tmpopcyady9/testfile.c -o /home/runner/work/_temp/mmd-ffmpeg/build/dav1d/meson-private/tmpopcyady9/output.obj -c -O3 -fPIC -D_FILE_OFFSET_BITS=64 -O0 -fvisibility=hidden` -> 0
Compiler for C supports arguments -fvisibility=hidden: YES 
Running compile:
Working directory:  /home/runner/work/_temp/mmd-ffmpeg/build/dav1d/meson-private/tmpoiojzdtk
Code:
 extern int i;
int i;

-----------
Command line: `x86_64-w64-mingw32-gcc-win32 -I/home/runner/work/_temp/mmd-ffmpeg/prefix/include /home/runner/work/_temp/mmd-ffmpeg/build/dav1d/meson-private/tmpoiojzdtk/testfile.c -o /home/runner/work/_temp/mmd-ffmpeg/build/dav1d/meson-private/tmpoiojzdtk/output.obj -c -O3 -fPIC -D_FILE_OFFSET_BITS=64 -O0 -Wundef` -> 0
Compiler for C supports arguments -Wundef: YES 
Running compile:
Working directory:  /home/runner/work/_temp/mmd-ffmpeg/build/dav1d/meson-private/tmpymbhj3uy
Code:
 extern int i;
int i;

-----------
Command line: `x86_64-w64-mingw32-gcc-win32 -I/home/runner/work/_temp/mmd-ffmpeg/prefix/include /home/runner/work/_temp/mmd-ffmpeg/build/dav1d/meson-private/tmpymbhj3uy/testfile.c -o /home/runner/work/_temp/mmd-ffmpeg/build/dav1d/meson-private/tmpymbhj3uy/output.obj -c -O3 -fPIC -D_FILE_OFFSET_BITS=64 -O0 -Werror=vla` -> 0
Compiler for C supports arguments -Werror=vla: YES 
Running compile:
Working directory:  /home/runner/work/_temp/mmd-ffmpeg/build/dav1d/meson-private/tmpytpdicey
Code:
 extern int i;
int i;

-----------
Command line: `x86_64-w64-mingw32-gcc-win32 -I/home/runner/work/_temp/mmd-ffmpeg/prefix/include /home/runner/work/_temp/mmd-ffmpeg/build/dav1d/meson-private/tmpytpdicey/testfile.c -o /home/runner/work/_temp/mmd-ffmpeg/build/dav1d/meson-private/tmpytpdicey/output.obj -c -O3 -fPIC -D_FILE_OFFSET_BITS=64 -O0 -Wmaybe-uninitialized -Wno-maybe-uninitialized` -> 0
Compiler for C supports arguments -Wno-maybe-uninitialized: YES 
Running compile:
Working directory:  /home/runner/work/_temp/mmd-ffmpeg/build/dav1d/meson-private/tmpf1pek1hw
Code:
 extern int i;
int i;

-----------
Command line: `x86_64-w64-mingw32-gcc-win32 -I/home/runner/work/_temp/mmd-ffmpeg/prefix/include /home/runner/work/_temp/mmd-ffmpeg/build/dav1d/meson-private/tmpf1pek1hw/testfile.c -o /home/runner/work/_temp/mmd-ffmpeg/build/dav1d/meson-private/tmpf1pek1hw/output.obj -c -O3 -fPIC -D_FILE_OFFSET_BITS=64 -O0 -Wmissing-field-initializers -Wno-missing-field-initializers` -> 0
Compiler for C supports arguments -Wno-missing-field-initializers: YES 
Running compile:
Working directory:  /home/runner/work/_temp/mmd-ffmpeg/build/dav1d/meson-private/tmp00l3_5uu
Code:
 extern int i;
int i;

-----------
Command line: `x86_64-w64-mingw32-gcc-win32 -I/home/runner/work/_temp/mmd-ffmpeg/prefix/include /home/runner/work/_temp/mmd-ffmpeg/build/dav1d/meson-private/tmp00l3_5uu/testfile.c -o /home/runner/work/_temp/mmd-ffmpeg/build/dav1d/meson-private/tmp00l3_5uu/output.obj -c -O3 -fPIC -D_FILE_OFFSET_BITS=64 -O0 -Wunused-parameter -Wno-unused-parameter` -> 0
Compiler for C supports arguments -Wno-unused-parameter: YES 
Running compile:
Working directory:  /home/runner/work/_temp/mmd-ffmpeg/build/dav1d/meson-private/tmpcd672en5
Code:
 extern int i;
int i;

-----------
Command line: `x86_64-w64-mingw32-gcc-win32 -I/home/runner/work/_temp/mmd-ffmpeg/prefix/include /home/runner/work/_temp/mmd-ffmpeg/build/dav1d/meson-private/tmpcd672en5/testfile.c -o /home/runner/work/_temp/mmd-ffmpeg/build/dav1d/meson-private/tmpcd672en5/output.obj -c -O3 -fPIC -D_FILE_OFFSET_BITS=64 -O0 -Wstrict-prototypes` -> 0
Compiler for C supports arguments -Wstrict-prototypes: YES 
Running compile:
Working directory:  /home/runner/work/_temp/mmd-ffmpeg/build/dav1d/meson-private/tmpgxmpqztw
Code:
 extern int i;
int i;

-----------
Command line: `x86_64-w64-mingw32-gcc-win32 -I/home/runner/work/_temp/mmd-ffmpeg/prefix/include /home/runner/work/_temp/mmd-ffmpeg/build/dav1d/meson-private/tmpgxmpqztw/testfile.c -o /home/runner/work/_temp/mmd-ffmpeg/build/dav1d/meson-private/tmpgxmpqztw/output.obj -c -O3 -fPIC -D_FILE_OFFSET_BITS=64 -O0 -Werror=missing-prototypes` -> 0
Compiler for C supports arguments -Werror=missing-prototypes: YES 
Running compile:
Working directory:  /home/runner/work/_temp/mmd-ffmpeg/build/dav1d/meson-private/tmplxi1nb4q
Code:
 extern int i;
int i;

-----------
Command line: `x86_64-w64-mingw32-gcc-win32 -I/home/runner/work/_temp/mmd-ffmpeg/prefix/include /home/runner/work/_temp/mmd-ffmpeg/build/dav1d/meson-private/tmplxi1nb4q/testfile.c -o /home/runner/work/_temp/mmd-ffmpeg/build/dav1d/meson-private/tmplxi1nb4q/output.obj -c -O3 -fPIC -D_FILE_OFFSET_BITS=64 -O0 -Wshorten-64-to-32` -> 1
stderr:
x86_64-w64-mingw32-gcc-win32: error: unrecognized command-line option '-Wshorten-64-to-32'
-----------
Compiler for C supports arguments -Wshorten-64-to-32: NO 
Running compile:
Working directory:  /home/runner/work/_temp/mmd-ffmpeg/build/dav1d/meson-private/tmpyjppvi84
Code:
 extern int i;
int i;

-----------
Command line: `x86_64-w64-mingw32-gcc-win32 -I/home/runner/work/_temp/mmd-ffmpeg/prefix/include /home/runner/work/_temp/mmd-ffmpeg/build/dav1d/meson-private/tmpyjppvi84/testfile.c -o /home/runner/work/_temp/mmd-ffmpeg/build/dav1d/meson-private/tmpyjppvi84/output.obj -c -O3 -fPIC -D_FILE_OFFSET_BITS=64 -O0 -fomit-frame-pointer` -> 0
Compiler for C supports arguments -fomit-frame-pointer: YES 
Running compile:
Working directory:  /home/runner/work/_temp/mmd-ffmpeg/build/dav1d/meson-private/tmpk4sz733r
Code:
 extern int i;
int i;

-----------
Command line: `x86_64-w64-mingw32-gcc-win32 -I/home/runner/work/_temp/mmd-ffmpeg/prefix/include /home/runner/work/_temp/mmd-ffmpeg/build/dav1d/meson-private/tmpk4sz733r/testfile.c -o /home/runner/work/_temp/mmd-ffmpeg/build/dav1d/meson-private/tmpk4sz733r/output.obj -c -O3 -fPIC -D_FILE_OFFSET_BITS=64 -O0 -ffast-math` -> 0
Compiler for C supports arguments -ffast-math: YES 
Running compile:
Working directory:  /home/runner/work/_temp/mmd-ffmpeg/build/dav1d/meson-private/tmpyhllr1mq
Code:
 int main(void) { return 0; }

-----------
Command line: `x86_64-w64-mingw32-gcc-win32 -L/home/runner/work/_temp/mmd-ffmpeg/prefix/lib -I/home/runner/work/_temp/mmd-ffmpeg/prefix/include /home/runner/work/_temp/mmd-ffmpeg/build/dav1d/meson-private/tmpyhllr1mq/testfile.c -o /home/runner/work/_temp/mmd-ffmpeg/build/dav1d/meson-private/tmpyhllr1mq/output.exe -O3 -fPIC -D_FILE_OFFSET_BITS=64 -O0 -Wl,--fatal-warnings -Wl,--dynamicbase,--nxcompat,--tsaware,--high-entropy-va -static -static-libgcc -static-libstdc++` -> 0
Compiler for C supports link arguments -Wl,--dynamicbase,--nxcompat,--tsaware,--high-entropy-va: YES 
Running compile:
Working directory:  /tmp/tmp5rwm5dt6
Code:
 
        
        #ifndef __AVX__
        # define __AVX__ "MESON_GET_DEFINE_UNDEFINED_SENTINEL"
        #endif
        "MESON_GET_DEFINE_DELIMITER_START"
__AVX__
"MESON_GET_DEFINE_DELIMITER_END"
-----------
Command line: `x86_64-w64-mingw32-gcc-win32 -I/home/runner/work/_temp/mmd-ffmpeg/prefix/include /tmp/tmp5rwm5dt6/testfile.c -E -P -O3 -fPIC -D_FILE_OFFSET_BITS=64 -P -O0 -std=c99` -> 0
stdout:
"MESON_GET_DEFINE_DELIMITER_START"
"MESON_GET_DEFINE_UNDEFINED_SENTINEL"
"MESON_GET_DEFINE_DELIMITER_END"
-----------
Fetching value of define "__AVX__" : (undefined) 
Program nasm found: YES (/usr/bin/nasm)
Running command: /usr/bin/nasm -v
--- stdout ---
NASM version 2.16.01

--- stderr ---


Configuring config.asm using configuration
Configuring config.h using configuration
Pkg-config binary for host machine specified from cross file, native file, or env var as ['pkg-config']
Found pkg-config: YES (/usr/bin/pkg-config) 1.8.1
Build targets in project: 5

dav1d 1.5.4

  User defined options
    Cross files    : /home/runner/work/_temp/mmd-ffmpeg/evidence/meson-cross.ini
    buildtype      : release
    default_library: static
    libdir         : lib
    prefix         : /home/runner/work/_temp/mmd-ffmpeg/prefix
    wrap_mode      : nodownload
    enable_tests   : false
    enable_tools   : false

Found ninja-1.13.2 at /usr/local/bin/ninja
!meson_ci!/ci_include "/home/runner/work/_temp/mmd-ffmpeg/build/dav1d/build.ninja"
